{"text_format":"1","workbook":"xlsx","n_sheets":6,"sheets":["Evaluación FG (3)","Evaluación FG (2)","Datos","Evaluación","Flujo","% Avance Const."],"not_rendered":{"charts":0,"images":3,"macros":1,"external_links":0,"defined_names":7,"comments":0,"pivot_tables":0},"unopened":[],"bounds":{"document_bytes":16777216,"sheet_cells":100000,"rows_first":2000,"rows_last":500,"rows_between":2000,"halvings":0,"cell_chars":16384,"cell_head_chars":4096},"cells_cut":0,"cells_raw":0,"read":"whole","date_system":"1900"}

{"sheet":"Evaluación FG (3)","index":0,"n_rows":132,"n_cols":17,"rows_kept":132,"cut":false,"hidden":true,"merged":[[15,8,16,8],[15,9,16,9],[10,3,10,4],[15,3,16,3],[15,4,16,4],[15,5,16,5],[15,6,16,6],[15,7,16,7]]}
[]
[null,null,"INMOBILIARIA VIVIENDAS 2000 LTDA."]
[null,null,"CONSTRUCTORA VIVIENDAS 2000 LTDA-"]
[]
[null,null,"EVALUACIÓN  DE COSTOS"]
[null,null,"Hernando  de  Aguirre"]
[]
[null,null,"SUPERFICIE LOTES, M2",4600,null,null,null,"VS ESTUDIO",null,1]
[null,null,"SUPERFICIE EDIFICACION, M2",{"$f":"+E39","v":24870},null,null,null,"FECHA ENTREGA",null,"2017-09-13"]
[null,null,"SUPERFICIE VENTA, M2",{"$f":"O20/2","v":5980}]
[null,null,"TIPO DE VIVIENDA","Departamentos"]
[null,null,"Nº VIVIENDAS",{"$f":"+N24","v":87},"N° VIV.","MODELO VIV.","TERRENOS [M2]","VALOR DE LA  UF",null,26600]
[null,null,null,null,null,null,null,"PLAZO DE EJECUCIÓN "]
[null,null,"Estacionamientos"]
[null,null,null," "]
[null,null,null,"UNIDAD","CANTIDAD","P.UNITARIO","VALOR UF","IVA","% COSTOS","% VENTAS"]
[]
[null,"1.-","TERRENO"]
[null,null,"Terreno","m2",{"$f":"D8","v":4600},70.5,{"$f":"+E19*F19","v":324300},null,null,null,null,null,"Zona","D"]
[null,null,"2.- Comisión compra","%",2.3800000000000002E-2,null,{"$f":"G19*E20","v":7718.34},null,null,null,null,null,"Coeficiente de Constructibilidad",2,{"$f":"+N20*1.3*D8","v":11960},"mt2"]
{"$rows_left_out":113}
{"sheet":"Evaluación FG (2)","index":1,"n_rows":132,"n_cols":16,"rows_kept":132,"cut":false,"hidden":true,"merged":[[15,8,16,8],[15,9,16,9],[10,3,10,4],[15,3,16,3],[15,4,16,4],[15,5,16,5],[15,6,16,6],[15,7,16,7]]}
[]
[null,null,"INMOBILIARIA VIVIENDAS 2000 LTDA."]
[null,null,"CONSTRUCTORA VIVIENDAS 2000 LTDA-"]
[]
[null,null,"EVALUACIÓN  DE COSTOS"]
[null,null,"Hernando  de  Aguirre"]
[]
[null,null,"SUPERFICIE LOTES, M2",4600,null,null,null,"VS ESTUDIO",null,1]
[null,null,"SUPERFICIE EDIFICACION, M2",{"$f":"+E39","v":16782},null,null,null,"FECHA ENTREGA",null,"2017-09-13"]
[null,null,"SUPERFICIE VENTA, M2",{"$f":"O20","v":9570}]
[null,null,"TIPO DE VIVIENDA","Departamentos"]
[null,null,"Nº VIVIENDAS",{"$f":"+N24","v":87},"N° VIV.","MODELO VIV.","TERRENOS [M2]","VALOR DE LA  UF",null,26600]
[null,null,null,null,null,null,null,"PLAZO DE EJECUCIÓN "]
[null,null,"Estacionamientos"]
[null,null,null," "]
[null,null,null,"UNIDAD","CANTIDAD","P.UNITARIO","VALOR UF","IVA","% COSTOS","% VENTAS"]
[]
[null,"1.-","TERRENO"]
[null,null,"Terreno","m2",{"$f":"D8","v":4600},70.5,{"$f":"+E19*F19","v":324300},null,null,null,null,null,"Zona","D"]
[null,null,"2.- Comisión compra","%",2.3800000000000002E-2,null,{"$f":"G19*E20","v":7718.34},null,null,null,null,null,"Coeficiente de Constructibilidad",2,9570,"mt2"]
{"$rows_left_out":113}
{"sheet":"Datos","index":2,"n_rows":53,"n_cols":10,"rows_kept":53,"cut":false,"hidden":false,"merged":[[0,1,1,3],[28,2,30,2],[28,1,30,1],[0,4,1,4],[33,1,33,5],[13,7,13,8],[8,1,8,2],[8,4,8,5],[8,7,8,8],[24,4,24,5]]}
[null,"DATOS TERRENO :"]
[]
[]
[null,"Proyecto"]
[null,"Tipología"]
[null,"Fecha "]
[null,"Versión"]
[]
[null,"Superficies y Cantidades",null,null,"Costos",null,null,"Plazos"]
[null,"Superficie Terreno [m2]",0,null,"Terreno [UF/m2]",0,null,"Mes Inicio Ventas"]
[null,"Superficie Deptos [m2]",0,null,"Demolición [UF/m2]",0,null,"Mes Inicio Construcción"]
[null,"Cantidad Deptos [Uni]",0,null,"Gastos Varios Terreno [UF/m2]",0,null,"Meses de Construcción"]
[null,"Superficie Terrazas [m2]",0,null," Departamentos [UF/m2]",0]
[null,"Superficie común edif. [m2]",0,null,"Terrazas [UF/m2]",0,null,"Avance Construcción y Urbanización "]
[null,"Superficie Subterraneo [m2]",0,null,"Superficie Común Edificio [UF/m2]",0,null,"Mes","% Avance","meses constru."]
[null,"Estacionamientos Subterraneos [Uni]",0,null,"Superficies Exteriores [UF/m2]",0,null,"mes 1",{"$f":"INDEX(Tabla35[[#All],[1]:[30]],MATCH(Tabla1[[#This Row],[Mes]],Tabla35[[#All],[Meses]],0),Datos!$I$12)/100","v":0.08},{"$f":"I11","v":0}]
[null,"Superficie Exterior [m2]",0,null,"Subterraneo [UF/m2]",0,null,"mes 2",{"$f":"INDEX(Tabla35[[#All],[1]:[30]],MATCH(Tabla1[[#This Row],[Mes]],Tabla35[[#All],[Meses]],0),Datos!$I$12)/100","v":0.15},{"$f":"J16+1","v":1}]
[null,"Estacionamientos Exteriores [Uni]",0,null,"Locales Comerciales [UF/m2]",0,null,"mes 3",{"$f":"INDEX(Tabla35[[#All],[1]:[30]],MATCH(Tabla1[[#This Row],[Mes]],Tabla35[[#All],[Meses]],0),Datos!$I$12)/100","v":0.17},{"$f":"J17+1","v":2}]
[null,"Estacionamientos Visita [Uni]",0,null,"Salas [UF/m2]",0,null,"mes 4",{"$f":"INDEX(Tabla35[[#All],[1]:[30]],MATCH(Tabla1[[#This Row],[Mes]],Tabla35[[#All],[Meses]],0),Datos!$I$12)/100","v":0.2},{"$f":"J18+1","v":3}]
[null,"Bodegas [Uni]",0,null,"DIA [UF]",0,null,"mes 5",{"$f":"INDEX(Tabla35[[#All],[1]:[30]],MATCH(Tabla1[[#This Row],[Mes]],Tabla35[[#All],[Meses]],0),Datos!$I$12)/100","v":0.17},{"$f":"J19+1","v":4}]
{"$rows_left_out":34}
{"sheet":"Evaluación","index":3,"n_rows":137,"n_cols":12,"rows_kept":137,"cut":false,"hidden":false,"merged":[[13,3,13,4],[18,3,19,3],[18,4,19,4],[18,5,19,5],[18,6,19,6],[18,10,19,12],[134,10,136,12],[18,8,19,8],[18,9,19,9],[18,7,19,7]]}
[]
[]
[null,null,"EVALUACIÓN  DE COSTOS"]
[]
[null,null,{"$f":"Datos!C4","v":0}]
[]
[]
[]
[]
[]
[null,null,"SUPERFICIE LOTES, M2",{"$f":"Datos!C10","v":0}]
[null,null,"SUPERFICIE EDIFICACION, M2",{"$f":"Datos!C27","v":0},null,null,null,"VS ESTUDIO",null,{"$f":"+Datos!C7","v":0}]
[null,null,"SUPERFICIE VENTA, M2",{"$f":"Datos!C26","v":0},null,null,null,"FECHA ENTREGA"]
[null,null,"TIPO DE VIVIENDA",{"$f":"+Datos!C5","v":0}]
[null,null,"Nº VIVIENDAS",{"$f":"Datos!C12","v":0},"N° VIV.","MODELO VIV.","TERRENOS [M2]","VELOCIDAD DE VENTA",null,{"$f":"Datos!C29","v":"-"}]
[null,null,null,null,{"$f":"+Datos!C12","v":0},null,{"$f":"+Datos!C10","v":0},"MESES DE CONSTRUCCIÓN",null,{"$f":"+Datos!I12","v":0}]
[]
[null,null,null," "]
[null,null,null,"UNIDAD","CANTIDAD","P.UNITARIO","VALOR UF","IVA","% COSTOS","% VENTAS","Firmas Aprobación"]
[]
{"$rows_left_out":118}
{"sheet":"Flujo","index":4,"n_rows":117,"n_cols":78,"rows_kept":117,"cut":false,"hidden":false,"merged":[]}
[null,null,null,{"$f":"YEAR(D3)","v":2022},2022,2022,2022,2022,2022,2022,2022,2022,2022,2022,{"$f":"YEAR(O3)","v":2022},{"$f":"YEAR(P3)","v":2023},2023,2023,2023,2023,2023,2023,2023,2023,2023,2023,2023,2024,2024,2024,2024,2024,2024,2024,2024,2024,2024,2024,2024,2025,2025,2025,2025,2025,2025,2025,2025,2025,2025,2025,2025,2026,2026,2026,2026,2026,2026,2026,2026,2026,2026,2026,2026,2027,2027,2027,2027,2027,2027,2027,2027,2027,2027,2027,2027,2028,2028,2028]
["FLUJO DE PROYECTO",null,null,0,1,2,3,4,5,6,7,8,9,10,11,12,13,14,15,16,17,18,19,20,21,22,23,24,25,26,27,28,29,30,31,32,33,34,35,36,37,38,39,40,41,42,43,44,45,46,47,48,49,50,51,52,53,54,55,56,57,58,59,60,61,62,63,64,65,66,67,68,69,70,71,72,73,74]
[null,null,null,"2022-01-01",{"$f":"EOMONTH(D3,0)+1","v":"2022-02-01"},{"$f":"EOMONTH(E3,0)+1","v":"2022-03-01"},"2022-04-01","2022-05-01","2022-06-01","2022-07-01","2022-08-01","2022-09-01","2022-10-01","2022-11-01","2022-12-01","2023-01-01","2023-02-01","2023-03-01","2023-04-01","2023-05-01","2023-06-01","2023-07-01","2023-08-01","2023-09-01","2023-10-01","2023-11-01","2023-12-01","2024-01-01","2024-02-01","2024-03-01","2024-04-01","2024-05-01","2024-06-01","2024-07-01","2024-08-01","2024-09-01","2024-10-01","2024-11-01","2024-12-01","2025-01-01","2025-02-01","2025-03-01","2025-04-01","2025-05-01","2025-06-01","2025-07-01","2025-08-01","2025-09-01","2025-10-01","2025-11-01","2025-12-01","2026-01-01","2026-02-01","2026-03-01","2026-04-01","2026-05-01","2026-06-01","2026-07-01","2026-08-01","2026-09-01","2026-10-01","2026-11-01","2026-12-01","2027-01-01","2027-02-01","2027-03-01","2027-04-01","2027-05-01","2027-06-01",{"$f":"EOMONTH(BQ3,0)+1","v":"2027-07-01"},"2027-08-01","2027-09-01","2027-10-01","2027-11-01","2027-12-01","2028-01-01","2028-02-01","2028-03-01"]
[{"$f":"Evaluación!C5","v":0},null,null,"mes 0","mes 1","mes 2","mes 3","mes 4","mes 5","mes 6","mes 7","mes 8","mes 9","mes 10","mes 11","mes 12","mes 13","mes 14","mes 15","mes 16","mes 17","mes 18","mes 19","mes 20","mes 21","mes 22","mes 23","mes 24","mes 25","mes 26","mes 27","mes 28","mes 29","mes 30","mes 31","mes 32","mes 33","mes 34","mes 35","mes 36","mes 37","mes 38","mes 39","mes 40","mes 41","mes 42","mes 43","mes 44","mes 45","mes 46","mes 47","mes 48","mes 49","mes 50","mes 51","mes 52","mes 53","mes 54","mes 55","mes 56","mes 57","mes 58","mes 59","mes 60","mes 61","mes 62","mes 63","mes 64","mes 65","mes 66","mes 67","mes 68","mes 69","mes 70","mes 71","mes 72","mes 73","mes 74"]
[]
["1.- TERRENO"]
[{"$f":"Evaluación!C22","v":"Terreno"},{"$f":"Evaluación!G22","v":0},{"$f":"IF(SUM(D7:BV7)=B7,\"OK\",\"\")","v":"OK"}]
[{"$f":"Evaluación!C23","v":"Comisión compra"},{"$f":"Evaluación!G23","v":0},{"$f":"IF(SUM(D8:BV8)=B8,\"OK\",\"\")","v":"OK"},{"$f":"B8","v":0}]
[{"$f":"Evaluación!C24","v":"Gastos Demolición"},{"$f":"Evaluación!G24","v":0},{"$f":"IF(SUM(D9:BV9)=B9,\"OK\",\"\")","v":"OK"},{"$f":"B9","v":0}]
[{"$f":"Evaluación!C25","v":"Varios"},{"$f":"Evaluación!G25","v":0},{"$f":"IF(SUM(D10:BV10)=B10,\"OK\",\"\")","v":"OK"},{"$f":"B10","v":0}]
["Avance Macrourbanización",1,{"$f":"IF(SUM(E11:AN11)=B11,\"OK\",\"\")","v":""}]
[null,null,{"$f":"IF(SUM(E12:AN12)=B12,\"OK\",\"\")","v":"OK"},null,{"$f":"+IF(E11=\"\",\"\",E11*$B$12)","v":""},"","","","","","","","","","","","","","","","","","","","","","","","","","","","","","","",{"$f":"+IF(AK11=\"\",\"\",AK11*$B$12)","v":""},{"$f":"+IF(AL11=\"\",\"\",AL11*$B$12)","v":""},{"$f":"+IF(AM11=\"\",\"\",AM11*$B$12)","v":""},{"$f":"+IF(AN11=\"\",\"\",AN11*$B$12)","v":""}]
[null,null,{"$f":"IF(SUM(E13:AN13)=B13,\"OK\",\"\")","v":"OK"},null,{"$f":"+IF(E12=\"\",\"\",E12*0.19)","v":""},"","","","","","","","","","","","","","","","","","","","","","","","","","","","","","","",{"$f":"+IF(AK12=\"\",\"\",AK12*0.19)","v":""},{"$f":"+IF(AL12=\"\",\"\",AL12*0.19)","v":""},{"$f":"+IF(AM12=\"\",\"\",AM12*0.19)","v":""},{"$f":"+IF(AN12=\"\",\"\",AN12*0.19)","v":""}]
[null,null,{"$f":"IF(SUM(E14:AN14)=B14,\"OK\",\"\")","v":"OK"},null,{"$f":"+IF(E11=\"\",\"\",E11*$B$14)","v":""},"","","","","",{"$f":"+IF(K11=\"\",\"\",K11*$B$14)","v":""},"","","","","","","","","","","","","","","","","","","","","","","","","","","","",""]
[]
["   Total Terreno",{"$f":"+SUM(B7:B10)","v":0},{"$f":"IF(SUM(D16:BV16)=B16,\"OK\",\"\")","v":"OK"},{"$f":"SUM(D7:D14)","v":0},{"$f":"SUM(E7:E14)","v":0},{"$f":"SUM(F7:F14)","v":0},0,0,0,0,0,0,0,0,0,0,0,0,0,0,0,0,0,0,0,0,0,0,0,0,0,0,0,0,0,0,0,0,0,0,0,0,0,0,{"$f":"SUM(AS7:AS14)","v":0},0,0,0,0,0,0,0,0,0,{"$f":"SUM(BC7:BC14)","v":0},{"$f":"SUM(BD7:BD14)","v":0},{"$f":"SUM(BE7:BE14)","v":0},{"$f":"SUM(BF7:BF14)","v":0},{"$f":"SUM(BG7:BG14)","v":0},0,0,0,0,0,{"$f":"SUM(BM7:BM14)","v":0},0,0,0,0,0,0,0,0,0,{"$f":"SUM(BW7:BW14)","v":0},{"$f":"SUM(BX7:BX14)","v":0},{"$f":"SUM(BY7:BY14)","v":0},{"$f":"SUM(BZ7:BZ14)","v":0}]
[]
["2.- CONSTRUCCIÓN"]
["Avance Edificación",1,{"$f":"IF(SUM(E19:BV19)=B19,\"OK\",\"\")","v":""},null,{"$f":"IF(E2>=Datos!$I$11,IFERROR(INDEX(Tabla1[],MATCH(E2,Tabla1[meses constru.],0),2),0),0)","v":0.15},{"$f":"IF(F2>=Datos!$I$11,IFERROR(INDEX(Tabla1[],MATCH(F2,Tabla1[meses constru.],0),2),0),0)","v":0.17},{"$f":"IF(G2>=Datos!$I$11,IFERROR(INDEX(Tabla1[],MATCH(G2,Tabla1[meses constru.],0),2),0),0)","v":0.2},{"$f":"IF(H2>=Datos!$I$11,IFERROR(INDEX(Tabla1[],MATCH(H2,Tabla1[meses constru.],0),2),0),0)","v":0.17},{"$f":"IF(I2>=Datos!$I$11,IFERROR(INDEX(Tabla1[],MATCH(I2,Tabla1[meses constru.],0),2),0),0)","v":0.15},{"$f":"IF(J2>=Datos!$I$11,IFERROR(INDEX(Tabla1[],MATCH(J2,Tabla1[meses constru.],0),2),0),0)","v":0.08},{"$f":"IF(K2>=Datos!$I$11,IFERROR(INDEX(Tabla1[],MATCH(K2,Tabla1[meses constru.],0),2),0),0)","v":0},{"$f":"IF(L2>=Datos!$I$11,IFERROR(INDEX(Tabla1[],MATCH(L2,Tabla1[meses constru.],0),2),0),0)","v":0},{"$f":"IF(M2>=Datos!$I$11,IFERROR(INDEX(Tabla1[],MATCH(M2,Tabla1[meses constru.],0),2),0),0)","v":0},{"$f":"IF(N2>=Datos!$I$11,IFERROR(INDEX(Tabla1[],MATCH(N2,Tabla1[meses constru.],0),2),0),0)","v":0},{"$f":"IF(O2>=Datos!$I$11,IFERROR(INDEX(Tabla1[],MATCH(O2,Tabla1[meses constru.],0),2),0),0)","v":0},{"$f":"IF(P2>=Datos!$I$11,IFERROR(INDEX(Tabla1[],MATCH(P2,Tabla1[meses constru.],0),2),0),0)","v":0},{"$f":"IF(Q2>=Datos!$I$11,IFERROR(INDEX(Tabla1[],MATCH(Q2,Tabla1[meses constru.],0),2),0),0)","v":0},{"$f":"IF(R2>=Datos!$I$11,IFERROR(INDEX(Tabla1[],MATCH(R2,Tabla1[meses constru.],0),2),0),0)","v":0},{"$f":"IF(S2>=Datos!$I$11,IFERROR(INDEX(Tabla1[],MATCH(S2,Tabla1[meses constru.],0),2),0),0)","v":0},{"$f":"IF(T2>=Datos!$I$11,IFERROR(INDEX(Tabla1[],MATCH(T2,Tabla1[meses constru.],0),2),0),0)","v":0},{"$f":"IF(U2>=Datos!$I$11,IFERROR(INDEX(Tabla1[],MATCH(U2,Tabla1[meses constru.],0),2),0),0)","v":0},{"$f":"IF(V2>=Datos!$I$11,IFERROR(INDEX(Tabla1[],MATCH(V2,Tabla1[meses constru.],0),2),0),0)","v":0},{"$f":"IF(W2>=Datos!$I$11,IFERROR(INDEX(Tabla1[],MATCH(W2,Tabla1[meses constru.],0),2),0),0)","v":0},{"$f":"IF(X2>=Datos!$I$11,IFERROR(INDEX(Tabla1[],MATCH(X2,Tabla1[meses constru.],0),2),0),0)","v":0},{"$f":"IF(Y2>=Datos!$I$11,IFERROR(INDEX(Tabla1[],MATCH(Y2,Tabla1[meses constru.],0),2),0),0)","v":0},{"$f":"IF(Z2>=Datos!$I$11,IFERROR(INDEX(Tabla1[],MATCH(Z2,Tabla1[meses constru.],0),2),0),0)","v":0},{"$f":"IF(AA2>=Datos!$I$11,IFERROR(INDEX(Tabla1[],MATCH(AA2,Tabla1[meses constru.],0),2),0),0)","v":0},{"$f":"IF(AB2>=Datos!$I$11,IFERROR(INDEX(Tabla1[],MATCH(AB2,Tabla1[meses constru.],0),2),0),0)","v":0},{"$f":"IF(AC2>=Datos!$I$11,IFERROR(INDEX(Tabla1[],MATCH(AC2,Tabla1[meses constru.],0),2),0),0)","v":0},{"$f":"IF(AD2>=Datos!$I$11,IFERROR(INDEX(Tabla1[],MATCH(AD2,Tabla1[meses constru.],0),2),0),0)","v":0},{"$f":"IF(AE2>=Datos!$I$11,IFERROR(INDEX(Tabla1[],MATCH(AE2,Tabla1[meses constru.],0),2),0),0)","v":0},{"$f":"IF(AF2>=Datos!$I$11,IFERROR(INDEX(Tabla1[],MATCH(AF2,Tabla1[meses constru.],0),2),0),0)","v":0},{"$f":"IF(AG2>=Datos!$I$11,IFERROR(INDEX(Tabla1[],MATCH(AG2,Tabla1[meses constru.],0),2),0),0)","v":0},{"$f":"IF(AH2>=Datos!$I$11,IFERROR(INDEX(Tabla1[],MATCH(AH2,Tabla1[meses constru.],0),2),0),0)","v":0},{"$f":"IF(AI2>=Datos!$I$11,IFERROR(INDEX(Tabla1[],MATCH(AI2,Tabla1[meses constru.],0),2),0),0)","v":0},{"$f":"IF(AJ2>=Datos!$I$11,IFERROR(INDEX(Tabla1[],MATCH(AJ2,Tabla1[meses constru.],0),2),0),0)","v":0},{"$f":"IF(AK2>=Datos!$I$11,IFERROR(INDEX(Tabla1[],MATCH(AK2,Tabla1[meses constru.],0),2),0),0)","v":0},{"$f":"IF(AL2>=Datos!$I$11,IFERROR(INDEX(Tabla1[],MATCH(AL2,Tabla1[meses constru.],0),2),0),0)","v":0},{"$f":"IF(AM2>=Datos!$I$11,IFERROR(INDEX(Tabla1[],MATCH(AM2,Tabla1[meses constru.],0),2),0),0)","v":0},{"$f":"IF(AN2>=Datos!$I$11,IFERROR(INDEX(Tabla1[],MATCH(AN2,Tabla1[meses constru.],0),2),0),0)","v":0},{"$f":"IF(AO2>=Datos!$I$11,IFERROR(INDEX(Tabla1[],MATCH(AO2,Tabla1[meses constru.],0),2),0),0)","v":0},{"$f":"IF(AP2>=Datos!$I$11,IFERROR(INDEX(Tabla1[],MATCH(AP2,Tabla1[meses constru.],0),2),0),0)","v":0},{"$f":"IF(AQ2>=Datos!$I$11,IFERROR(INDEX(Tabla1[],MATCH(AQ2,Tabla1[meses constru.],0),2),0),0)","v":0},{"$f":"IF(AR2>=Datos!$I$11,IFERROR(INDEX(Tabla1[],MATCH(AR2,Tabla1[meses constru.],0),2),0),0)","v":0},{"$f":"IF(AS2>=Datos!$I$11,IFERROR(INDEX(Tabla1[],MATCH(AS2,Tabla1[meses constru.],0),2),0),0)","v":0},{"$f":"IF(AT2>=Datos!$I$11,IFERROR(INDEX(Tabla1[],MATCH(AT2,Tabla1[meses constru.],0),2),0),0)","v":0},{"$f":"IF(AU2>=Datos!$I$11,IFERROR(INDEX(Tabla1[],MATCH(AU2,Tabla1[meses constru.],0),2),0),0)","v":0},{"$f":"IF(AV2>=Datos!$I$11,IFERROR(INDEX(Tabla1[],MATCH(AV2,Tabla1[meses constru.],0),2),0),0)","v":0},{"$f":"IF(AW2>=Datos!$I$11,IFERROR(INDEX(Tabla1[],MATCH(AW2,Tabla1[meses constru.],0),2),0),0)","v":0},{"$f":"IF(AX2>=Datos!$I$11,IFERROR(INDEX(Tabla1[],MATCH(AX2,Tabla1[Mes],0),2),0),0)","v":0},{"$f":"IF(AY2>=Datos!$I$11,IFERROR(INDEX(Tabla1[],MATCH(AY2,Tabla1[% Avance],0),2),0),0)","v":0},{"$f":"IF(AZ2>=Datos!$I$11,IFERROR(INDEX(Tabla1[],MATCH(AZ2,Tabla1[meses constru.],0),2),0),0)","v":0},{"$f":"IF(BA2>=Datos!$I$11,IFERROR(INDEX(Tabla1[],MATCH(BA2,Tabla1[Mes],0),2),0),0)","v":0},{"$f":"IF(BB2>=Datos!$I$11,IFERROR(INDEX(Tabla1[],MATCH(BB2,Tabla1[% Avance],0),2),0),0)","v":0},{"$f":"IF(BC2>=Datos!$I$11,IFERROR(INDEX(Tabla1[],MATCH(BC2,Tabla1[% Avance],0),2),0),0)","v":0},{"$f":"IF(BD2>=Datos!$I$11,IFERROR(INDEX(Tabla1[],MATCH(BD2,Tabla1[meses constru.],0),2),0),0)","v":0},{"$f":"IF(BE2>=Datos!$I$11,IFERROR(INDEX(Tabla1[],MATCH(BE2,Tabla1[% Avance],0),2),0),0)","v":0},{"$f":"IF(BF2>=Datos!$I$11,IFERROR(INDEX(Tabla1[],MATCH(BF2,Tabla1[meses constru.],0),2),0),0)","v":0},{"$f":"IF(BG2>=Datos!$I$11,IFERROR(INDEX(Tabla1[],MATCH(BG2,Tabla1[meses constru.],0),2),0),0)","v":0},{"$f":"IF(BH2>=Datos!$I$11,IFERROR(INDEX(Tabla1[],MATCH(BH2,Tabla1[Mes],0),2),0),0)","v":0},{"$f":"IF(BI2>=Datos!$I$11,IFERROR(INDEX(Tabla1[],MATCH(BI2,Tabla1[meses constru.],0),2),0),0)","v":0},{"$f":"IF(BJ2>=Datos!$I$11,IFERROR(INDEX(Tabla1[],MATCH(BJ2,Tabla1[Mes],0),2),0),0)","v":0},{"$f":"IF(BK2>=Datos!$I$11,IFERROR(INDEX(Tabla1[],MATCH(BK2,Tabla1[Mes],0),2),0),0)","v":0},{"$f":"IF(BL2>=Datos!$I$11,IFERROR(INDEX(Tabla1[],MATCH(BL2,Tabla1[% Avance],0),2),0),0)","v":0},{"$f":"IF(BM2>=Datos!$I$11,IFERROR(INDEX(Tabla1[],MATCH(BM2,Tabla1[% Avance],0),2),0),0)","v":0},{"$f":"IF(BN2>=Datos!$I$11,IFERROR(INDEX(Tabla1[],MATCH(BN2,Tabla1[meses constru.],0),2),0),0)","v":0},{"$f":"IF(BO2>=Datos!$I$11,IFERROR(INDEX(Tabla1[],MATCH(BO2,Tabla1[meses constru.],0),2),0),0)","v":0},{"$f":"IF(BP2>=Datos!$I$11,IFERROR(INDEX(Tabla1[],MATCH(BP2,Tabla1[Mes],0),2),0),0)","v":0},{"$f":"IF(BQ2>=Datos!$I$11,IFERROR(INDEX(Tabla1[],MATCH(BQ2,Tabla1[Mes],0),2),0),0)","v":0},{"$f":"IF(BR2>=Datos!$I$11,IFERROR(INDEX(Tabla1[],MATCH(BR2,Tabla1[% Avance],0),2),0),0)","v":0},{"$f":"IF(BS2>=Datos!$I$11,IFERROR(INDEX(Tabla1[],MATCH(BS2,Tabla1[% Avance],0),2),0),0)","v":0},{"$f":"IF(BT2>=Datos!$I$11,IFERROR(INDEX(Tabla1[],MATCH(BT2,Tabla1[meses constru.],0),2),0),0)","v":0},{"$f":"IF(BU2>=Datos!$I$11,IFERROR(INDEX(Tabla1[],MATCH(BU2,Tabla1[meses constru.],0),2),0),0)","v":0},{"$f":"IF(BV2>=Datos!$I$11,IFERROR(INDEX(Tabla1[],MATCH(BV2,Tabla1[Mes],0),2),0),0)","v":0},{"$f":"IF(BW2>=Datos!$I$11,IFERROR(INDEX(Tabla1[],MATCH(BW2,Tabla1[% Avance],0),2),0),0)","v":0},{"$f":"IF(BX2>=Datos!$I$11,IFERROR(INDEX(Tabla1[],MATCH(BX2,Tabla1[meses constru.],0),2),0),0)","v":0},{"$f":"IF(BY2>=Datos!$I$11,IFERROR(INDEX(Tabla1[],MATCH(BY2,Tabla1[Mes],0),2),0),0)","v":0},{"$f":"IF(BZ2>=Datos!$I$11,IFERROR(INDEX(Tabla1[],MATCH(BZ2,Tabla1[% Avance],0),2),0),0)","v":0}]
[{"$f":"Evaluación!C62","v":"   Total Construcción Neto"},{"$f":"Evaluación!G44","v":0},{"$f":"IF(SUM(E20:BV20)=B20,\"OK\",\"\")","v":"OK"},null,{"$f":"+IF(E19=\"\",\"\",E19*$B$20)","v":0},{"$f":"+IF(F19=\"\",\"\",F19*$B$20)","v":0},0,0,0,{"$f":"+IF(J19=\"\",\"\",J19*$B$20)","v":0},{"$f":"+IF(K19=\"\",\"\",K19*$B$20)","v":0},0,0,0,0,0,0,0,0,0,0,{"$f":"+IF(V19=\"\",\"\",V19*$B$20)","v":0},0,0,0,0,0,0,0,0,0,0,0,0,0,0,0,0,0,0,0,0,0,0,{"$f":"+IF(AS19=\"\",\"\",AS19*$B$20)","v":0},0,0,0,0,0,0,0,0,0,{"$f":"+IF(BC19=\"\",\"\",BC19*$B$20)","v":0},{"$f":"+IF(BD19=\"\",\"\",BD19*$B$20)","v":0},{"$f":"+IF(BE19=\"\",\"\",BE19*$B$20)","v":0},{"$f":"+IF(BF19=\"\",\"\",BF19*$B$20)","v":0},{"$f":"+IF(BG19=\"\",\"\",BG19*$B$20)","v":0},0,0,0,0,0,{"$f":"+IF(BM19=\"\",\"\",BM19*$B$20)","v":0},0,0,0,0,0,0,0,0,0,{"$f":"+IF(BW19=\"\",\"\",BW19*$B$20)","v":0},{"$f":"+IF(BX19=\"\",\"\",BX19*$B$20)","v":0},{"$f":"+IF(BY19=\"\",\"\",BY19*$B$20)","v":0},{"$f":"+IF(BZ19=\"\",\"\",BZ19*$B$20)","v":0}]
{"$rows_left_out":98}
{"sheet":"% Avance Const.","index":5,"n_rows":33,"n_cols":32,"rows_kept":33,"cut":false,"hidden":false,"merged":[]}
[]
[null,"Meses","1","2","3","4","5","6","7","8","9","10","11","12","13","14","15","16","17","18","19","20","21","22","23","24","25","26","27","28","29","30"]
[null,"mes 1",100,50,33,20,15,10,8,7,5,4,10,10,10,10,10,10,10,10,10,10,10,10,10,10,10,10,10,10,10,10]
[null,"mes 2",0,50,34,30,20,15,15,9,8,6,4,4,4,3,3,3,3,3,2,2,2,2,2,2,1,1,1,1,1,1]
[null,"mes 3",0,0,33,30,30,25,17,15,13,9,7,7,5,5,3,3,3,3,3,2,2,2,2,2,2,2,2,2,2,2]
[null,"mes 4",0,0,0,20,20,25,20,19,16,13,9,9,5,5,6,4,4,4,3,3,3,3,2,2,2,2,2,2,2,2]
[null,"mes 5",0,0,0,0,15,15,17,19,16,18,13,12,7,7,7,5,5,5,4,4,3,3,3,3,3,3,2,3,3,3]
[null,"mes 6",0,0,0,0,0,10,15,15,16,18,14,14,9,8,8,7,6,6,5,5,4,4,4,4,3,2,2,2,2,2]
[null,"mes 7",0,0,0,0,0,0,8,9,13,13,14,14,10,9,8,8,8,7,5,6,5,4,4,4,3,2,3,2,2,2]
[null,"mes 8",0,0,0,0,0,0,0,7,8,9,12,12,11,9,8,9,9,8,7,7,6,5,5,5,4,3,3,3,3,3]
[null,"mes 9",0,0,0,0,0,0,0,0,5,6,9,8,11,9,9,9,9,9,8,8,7,6,5,5,4,3,3,3,3,3]
[null,"mes 10",0,0,0,0,0,0,0,0,0,4,5,5,10,9,9,8,9,9,9,9,8,7,6,5,5,4,4,5,5,5]
[null,"mes 11",0,0,0,0,0,0,0,0,0,0,3,3,9,9,8,8,7,8,8,9,9,8,6,6,5,5,4,4,4,4]
[null,"mes 12",0,0,0,0,0,0,0,0,0,0,0,2,7,8,8,7,6,7,8,8,9,8,7,6,6,5,5,6,6,6]
[null,"mes 13",0,0,0,0,0,0,0,0,0,0,0,0,2,6,7,7,6,5,6,7,7,7,8,7,6,5,6,5,5,5]
[null,"mes 14",0,0,0,0,0,0,0,0,0,0,0,0,0,3,4,6,5,4,6,5,5,6,8,8,7,6,6,6,6,6]
[null,"mes 15",0,0,0,0,0,0,0,0,0,0,0,0,0,0,2,3,5,4,4,4,5,5,7,7,7,6,7,7,7,6]
[null,"mes 16",0,0,0,0,0,0,0,0,0,0,0,0,0,0,0,3,3,3,4,3,4,5,5,6,7,6,6,7,6,6]
[null,"mes 17",0,0,0,0,0,0,0,0,0,0,0,0,0,0,0,0,2,3,3,3,3,4,4,4,5,6,5,6,6,6]
[null,"mes 18",0,0,0,0,0,0,0,0,0,0,0,0,0,0,0,0,0,2,3,2,3,3,3,3,4,5,4,5,5,5]
{"$rows_left_out":13}